﻿"Item Id","Item URI","Dublin Core:Title","Dublin Core:Subject","Dublin Core:Description","Dublin Core:Creator","Dublin Core:Source","Dublin Core:Publisher","Dublin Core:Date","Dublin Core:Contributor","Dublin Core:Rights","Dublin Core:Relation","Dublin Core:Format","Dublin Core:Language","Dublin Core:Type","Dublin Core:Identifier","Dublin Core:Coverage","Item Type Metadata:Text","Item Type Metadata:Interviewer","Item Type Metadata:Interviewee","Item Type Metadata:Location","Item Type Metadata:Transcription","Item Type Metadata:Local URL","Item Type Metadata:Original Format","Item Type Metadata:Physical Dimensions","Item Type Metadata:Duration","Item Type Metadata:Compression","Item Type Metadata:Producer","Item Type Metadata:Director","Item Type Metadata:Bit Rate/Frequency","Item Type Metadata:Time Summary","Item Type Metadata:Email Body","Item Type Metadata:Subject Line","Item Type Metadata:From","Item Type Metadata:To","Item Type Metadata:CC","Item Type Metadata:BCC","Item Type Metadata:Number of Attachments","Item Type Metadata:Standards","Item Type Metadata:Objectives","Item Type Metadata:Materials","Item Type Metadata:Lesson Plan Text","Item Type Metadata:URL","Item Type Metadata:Event Type","Item Type Metadata:Participants","Item Type Metadata:Birth Date","Item Type Metadata:Birthplace","Item Type Metadata:Death Date","Item Type Metadata:Occupation","Item Type Metadata:Biographical Text","Item Type Metadata:Bibliography","Streaming Video:Video Filename","Streaming Video:Video Streaming URL","Streaming Video:Video Type","Streaming Video:HLS Streaming Directory","Streaming Video:HLS Video Filename","Streaming Video:HTTP Streaming Directory","Streaming Video:HTTP Video Filename","Streaming Video:Segment Start","Streaming Video:Segment End","Streaming Video:Segment Type","Streaming Video:Show Item","Streaming Video:Video Source",tags,file,itemType,collection,public,featured
3956,https://omeka.rmit.edu.vn/items/show/3956,,light^^shadow,"light and shadow in Hem","Andrew Stiff",,"RMIT Vietnam Library",2017-03-03,,"This work is licensed under a <a target=""_blank"" href=""https://creativecommons.org/licenses/by-nc-nd/4.0/"" rel=""noreferrer"">Creative Commons Attribution-NonCommercial-NoDerivatives 4.0 International License.</a>",,video,,,0119/2017-03-03/N/E/V/AS,,,,,,,,,,,,,,,,,,,,,,,,,,,,,,,,,,,,,,,,,,,,,,,,"Andrew Stiff,building,Edited,nature,Video",https://omeka.rmit.edu.vn/files/original/eecee79db367bde69450f43393719699.mp4,," NATURE",1,0
3946,https://omeka.rmit.edu.vn/items/show/3946,,wall^^texture,,"Andrew Stiff",,"RMIT Vietnam Library",2016-11-13,,"This work is licensed under a <a target=""_blank"" href=""https://creativecommons.org/licenses/by-nc-nd/4.0/"" rel=""noreferrer"">Creative Commons Attribution-NonCommercial-NoDerivatives 4.0 International License.</a>",,image,,,0109/2016-11-13/N/O/P/AS,,,,,,,,,,,,,,,,,,,,,,,,,,,,,,,,,,,,,,,,,,,,,,,,"Abstract,Andrew Stiff,building,Original",https://omeka.rmit.edu.vn/files/original/bf983a4fa7e0335fb5bba525e8327bd0.jpg,," NATURE",1,0
3942,https://omeka.rmit.edu.vn/items/show/3942,,tiles,,"Andrew Stiff",,"RMIT Vietnam Library",2016-11-13,,"This work is licensed under a <a target=""_blank"" href=""https://creativecommons.org/licenses/by-nc-nd/4.0/"" rel=""noreferrer"">Creative Commons Attribution-NonCommercial-NoDerivatives 4.0 International License.</a>",,image,,,0105/2016-11-13/B/O/P/AS,,,,,,,,,,,,,,,,,,,,,,,,,,,,,,,,,,,,,,,,,,,,,,,,"Andrew Stiff,building,Original,pattern",https://omeka.rmit.edu.vn/files/original/a2ae5a55a335790fd68284747dd55c1a.jpg,," BUILT ENVIRONMENT",1,0
7907,https://omeka.rmit.edu.vn/items/show/7907,"Zoom 6 - V1",zoom^^blur^^layers,"Zoom out of a still from a video. Blurred and layered.","Andrew Stiff",,,16/07/2017,,"This work is licensed under a <a target=""_blank"" href=""https://creativecommons.org/licenses/by-nc-nd/4.0/"" rel=""noreferrer"">Creative Commons Attribution-NonCommercial-NoDerivatives 4.0 International License.</a>",,Video,,,4407/2017-07-16/H/E/V/AS,,,,,,,,,,,,,,,,,,,,,,,,,,,,,,,,,,,,,,,,,,,,,,,,"Abstract,Andrew Stiff,Colour,Edited,Video",https://omeka.rmit.edu.vn/files/original/f35299f52504c48fa4dbf9b119150483.mp4,,COMMUNITY,1,0
7906,https://omeka.rmit.edu.vn/items/show/7906,"Zoom 5 - V1",zoom^^blur^^layers,"Zoom out of a still from a video. Blurred and layered.","Andrew Stiff",,,16/07/2017,,"This work is licensed under a <a target=""_blank"" href=""https://creativecommons.org/licenses/by-nc-nd/4.0/"" rel=""noreferrer"">Creative Commons Attribution-NonCommercial-NoDerivatives 4.0 International License.</a>",,Video,,,4406/2017-07-16/H/E/V/AS,,,,,,,,,,,,,,,,,,,,,,,,,,,,,,,,,,,,,,,,,,,,,,,,"Abstract,Andrew Stiff,Colour,Edited,Video",https://omeka.rmit.edu.vn/files/original/f5bb3ebcbb5d132c768beafc1eadc8cc.mp4,,COMMUNITY,1,0
7905,https://omeka.rmit.edu.vn/items/show/7905,"Zoom 4 - V2",zoom^^blur^^layers,"Zoom out of a still from a video. Blurred and layered.","Andrew Stiff",,,16/07/2017,,"This work is licensed under a <a target=""_blank"" href=""https://creativecommons.org/licenses/by-nc-nd/4.0/"" rel=""noreferrer"">Creative Commons Attribution-NonCommercial-NoDerivatives 4.0 International License.</a>",,Video,,,4405/2017-07-16/H/E/V/AS,,,,,,,,,,,,,,,,,,,,,,,,,,,,,,,,,,,,,,,,,,,,,,,,"Abstract,Andrew Stiff,Colour,Edited,Video",https://omeka.rmit.edu.vn/files/original/4b34de27a7bda7225ca45e6c610f9e04.mp4,,COMMUNITY,1,0
7904,https://omeka.rmit.edu.vn/items/show/7904,"Zoom 4 - V1",zoom^^blur^^layers,"Zoom out of a still from a video. Blurred and layered.","Andrew Stiff",,,16/07/2017,,"This work is licensed under a <a target=""_blank"" href=""https://creativecommons.org/licenses/by-nc-nd/4.0/"" rel=""noreferrer"">Creative Commons Attribution-NonCommercial-NoDerivatives 4.0 International License.</a>",,Video,,,4404/2017-07-16/H/E/V/AS,,,,,,,,,,,,,,,,,,,,,,,,,,,,,,,,,,,,,,,,,,,,,,,,"Abstract,Andrew Stiff,Colour,Edited,Video",https://omeka.rmit.edu.vn/files/original/38640b996bb1246b21b4a8453250e0a1.mp4,,COMMUNITY,1,0
7903,https://omeka.rmit.edu.vn/items/show/7903,"Zoom 3 - V2",zoom^^blur^^layers,"Zoom out of a still from a video. Blurred and layered.","Andrew Stiff",,,16/07/2017,,"This work is licensed under a <a target=""_blank"" href=""https://creativecommons.org/licenses/by-nc-nd/4.0/"" rel=""noreferrer"">Creative Commons Attribution-NonCommercial-NoDerivatives 4.0 International License.</a>",,Video,,,4403/2017-07-16/H/E/V/AS,,,,,,,,,,,,,,,,,,,,,,,,,,,,,,,,,,,,,,,,,,,,,,,,"Abstract,Andrew Stiff,Colour,Edited,Video",https://omeka.rmit.edu.vn/files/original/1b5470661a00b8389fecdd6d6575629d.mp4,,COMMUNITY,1,0
7902,https://omeka.rmit.edu.vn/items/show/7902,"Zoom 3 - V1",zoom^^blur^^layers,"Zoom out of a still from a video. Blurred and layered.","Andrew Stiff",,,16/07/2017,,"This work is licensed under a <a target=""_blank"" href=""https://creativecommons.org/licenses/by-nc-nd/4.0/"" rel=""noreferrer"">Creative Commons Attribution-NonCommercial-NoDerivatives 4.0 International License.</a>",,Video,,,4402/2017-07-16/H/E/V/AS,,,,,,,,,,,,,,,,,,,,,,,,,,,,,,,,,,,,,,,,,,,,,,,,"Abstract,Andrew Stiff,Colour,Edited,Video",https://omeka.rmit.edu.vn/files/original/58c84bb9ae8e3042c906f74618139477.mp4,,COMMUNITY,1,0
7901,https://omeka.rmit.edu.vn/items/show/7901,"Zoom 2 - V1",zoom^^blur^^layers,"Zoom out of a still from a video. Blurred and layered.","Andrew Stiff",,,16/07/2017,,"This work is licensed under a <a target=""_blank"" href=""https://creativecommons.org/licenses/by-nc-nd/4.0/"" rel=""noreferrer"">Creative Commons Attribution-NonCommercial-NoDerivatives 4.0 International License.</a>",,Video,,,4401/2017-07-16/H/E/V/AS,,,,,,,,,,,,,,,,,,,,,,,,,,,,,,,,,,,,,,,,,,,,,,,,"Abstract,Andrew Stiff,Colour,Edited,Video",https://omeka.rmit.edu.vn/files/original/a98439327206611fe834665af132ff67.mp4,,COMMUNITY,1,0
7900,https://omeka.rmit.edu.vn/items/show/7900,"Zoom 1 - V2",zoom^^blur^^layers,"Zoom out of a still from a video. Blurred and layered.","Andrew Stiff",,,16/07/2017,,"This work is licensed under a <a target=""_blank"" href=""https://creativecommons.org/licenses/by-nc-nd/4.0/"" rel=""noreferrer"">Creative Commons Attribution-NonCommercial-NoDerivatives 4.0 International License.</a>",,Video,,,4400/2017-07-16/H/E/V/AS,,,,,,,,,,,,,,,,,,,,,,,,,,,,,,,,,,,,,,,,,,,,,,,,"Abstract,Andrew Stiff,Colour,Edited,Video",https://omeka.rmit.edu.vn/files/original/a10a907e5a8b6f35c32a979e7128a410.mp4,,COMMUNITY,1,0
7899,https://omeka.rmit.edu.vn/items/show/7899,"Zoom 1 - V1",zoom^^blur^^layers,"Zoom out of a still from a video. Blurred and layered.","Andrew Stiff",,,16/07/2017,,"This work is licensed under a <a target=""_blank"" href=""https://creativecommons.org/licenses/by-nc-nd/4.0/"" rel=""noreferrer"">Creative Commons Attribution-NonCommercial-NoDerivatives 4.0 International License.</a>",,Video,,,4399/2017-07-16/H/E/V/AS,,,,,,,,,,,,,,,,,,,,,,,,,,,,,,,,,,,,,,,,,,,,,,,,"Abstract,Andrew Stiff,Colour,Edited,Video",https://omeka.rmit.edu.vn/files/original/9f1efbfb4edd47fc542ecebdddd4ff87.mp4,,COMMUNITY,1,0
3845,https://omeka.rmit.edu.vn/items/show/3845,"Yellow wall and mesh",wall^^poster^^texture,"Torn poster remnants on a yellow wall. The paint is peeling and scratched. A perforated Metal screen covers the window opening.","Andrew Stiff",,"RMIT Vietnam Library",2016-08-07,,"This work is licensed under a <a target=""_blank"" href=""https://creativecommons.org/licenses/by-nc-nd/4.0/"" rel=""noreferrer"">Creative Commons Attribution-NonCommercial-NoDerivatives 4.0 International License.</a>",,image,,,0001/2016-08-07/B/O/P/AS,,,,,,,,,,,,,,,,,,,,,,,,,,,,,,,,,,,,,,,,,,,,,,,,"Abstract,Andrew Stiff,building,metal,Original",https://omeka.rmit.edu.vn/files/original/c5dfa28da1fb2ee7a27c5348c81bf00a.JPG,," BUILT ENVIRONMENT",1,0
6360,https://omeka.rmit.edu.vn/items/show/6360,"Worm view 9","worm view^^sky","A worm view of the Hem","Desiree Calvo Grunewald",,,4/10/2017,,"This work is licensed under a <a target=""_blank"" href=""https://creativecommons.org/licenses/by-nc-nd/4.0/"" rel=""noreferrer"">Creative Commons Attribution-NonCommercial-NoDerivatives 4.0 International License.</a>",,Photo,,,1551/2017-04-10/B/O/P/DG,,,,,,,,,,,,,,,,,,,,,,,,,,,,,,,,,,,,,,,,,,,,,,,,"building,Desiree Calvo Grunewald,Original,Photography",https://omeka.rmit.edu.vn/files/original/9af6fccdfb0b64f2cca49af5f32dbfb8.jpg,," BUILT ENVIRONMENT",1,0
6359,https://omeka.rmit.edu.vn/items/show/6359,"Worm view 8","worm view^^sky","A worm view of the Hem","Desiree Calvo Grunewald",,,4/10/2017,,"This work is licensed under a <a target=""_blank"" href=""https://creativecommons.org/licenses/by-nc-nd/4.0/"" rel=""noreferrer"">Creative Commons Attribution-NonCommercial-NoDerivatives 4.0 International License.</a>",,Photo,,,1548/2017-04-10/B/O/P/DG,,,,,,,,,,,,,,,,,,,,,,,,,,,,,,,,,,,,,,,,,,,,,,,,Original,https://omeka.rmit.edu.vn/files/original/d994133dc891a75821adb87d0d52e323.jpg,," BUILT ENVIRONMENT",1,0
6358,https://omeka.rmit.edu.vn/items/show/6358,"Worm view 7","worm view^^sky","A worm view of the Hem","Desiree Calvo Grunewald",,,4/10/2017,,"This work is licensed under a <a target=""_blank"" href=""https://creativecommons.org/licenses/by-nc-nd/4.0/"" rel=""noreferrer"">Creative Commons Attribution-NonCommercial-NoDerivatives 4.0 International License.</a>",,Photo,,,1547/2017-04-10/B/O/P/DG,,,,,,,,,,,,,,,,,,,,,,,,,,,,,,,,,,,,,,,,,,,,,,,,"building,Desiree Calvo Grunewald,Original,Photography,wires",https://omeka.rmit.edu.vn/files/original/7689b6a0992bd6fdffd807d9e1af7e42.jpg,," BUILT ENVIRONMENT",1,0
6357,https://omeka.rmit.edu.vn/items/show/6357,"Worm view 6","worm view^^sky","A worm view of the Hem, revealing a small crack of blue sky","Desiree Calvo Grunewald",,,4/10/2017,,"This work is licensed under a <a target=""_blank"" href=""https://creativecommons.org/licenses/by-nc-nd/4.0/"" rel=""noreferrer"">Creative Commons Attribution-NonCommercial-NoDerivatives 4.0 International License.</a>",,Photo,,,1543/2017-04-10/B/O/P/DG,,,,,,,,,,,,,,,,,,,,,,,,,,,,,,,,,,,,,,,,,,,,,,,,Original,https://omeka.rmit.edu.vn/files/original/1c98f69d32c5980b81457c29ce9b26bf.jpg,," BUILT ENVIRONMENT",1,0
6356,https://omeka.rmit.edu.vn/items/show/6356,"Worm view 5","worm view^^sky","A worm view of the Hem, revealing a small crack of blue sky","Desiree Calvo Grunewald",,,4/10/2017,,"This work is licensed under a <a target=""_blank"" href=""https://creativecommons.org/licenses/by-nc-nd/4.0/"" rel=""noreferrer"">Creative Commons Attribution-NonCommercial-NoDerivatives 4.0 International License.</a>",,Photo,,,1542/2017-04-10/B/O/P/DG,,,,,,,,,,,,,,,,,,,,,,,,,,,,,,,,,,,,,,,,,,,,,,,,"building,Desiree Calvo Grunewald,Original,Photography,wires",https://omeka.rmit.edu.vn/files/original/613757a026f2934ccc6456d2f1eb57fd.jpg,," BUILT ENVIRONMENT",1,0
6354,https://omeka.rmit.edu.vn/items/show/6354,"Worm view 4","worm view^^sky","A worm view of the Hem, revealing a small crack of blue sky","Desiree Calvo Grunewald",,,4/10/2017,,"This work is licensed under a <a target=""_blank"" href=""https://creativecommons.org/licenses/by-nc-nd/4.0/"" rel=""noreferrer"">Creative Commons Attribution-NonCommercial-NoDerivatives 4.0 International License.</a>",,Photo,,,1540/2017-04-10/B/O/P/DG,,,,,,,,,,,,,,,,,,,,,,,,,,,,,,,,,,,,,,,,,,,,,,,,"building,Desiree Calvo Grunewald,Original,Photography",https://omeka.rmit.edu.vn/files/original/63e7068ab0c460d0a3b86ad73965290b.jpg,," BUILT ENVIRONMENT",1,0
6353,https://omeka.rmit.edu.vn/items/show/6353,"Worm view 3","worm view^^sky","A worm view of the Hem, revealing a small crack of blue sky","Desiree Calvo Grunewald",,,4/10/2017,,"This work is licensed under a <a target=""_blank"" href=""https://creativecommons.org/licenses/by-nc-nd/4.0/"" rel=""noreferrer"">Creative Commons Attribution-NonCommercial-NoDerivatives 4.0 International License.</a>",,Photo,,,1539/2017-04-10/B/O/P/DG,,,,,,,,,,,,,,,,,,,,,,,,,,,,,,,,,,,,,,,,,,,,,,,,"building,Desiree Calvo Grunewald,Original,Photography",https://omeka.rmit.edu.vn/files/original/2bbcf8bd43a531e24111f9c3617b21e0.jpg,," BUILT ENVIRONMENT",1,0
6346,https://omeka.rmit.edu.vn/items/show/6346,"Worm view 2","worm view^^sky","A worm view of the Hem, revealing a small crack of blue sky","Desiree Calvo Grunewald",,,4/10/2017,,"This work is licensed under a <a target=""_blank"" href=""https://creativecommons.org/licenses/by-nc-nd/4.0/"" rel=""noreferrer"">Creative Commons Attribution-NonCommercial-NoDerivatives 4.0 International License.</a>",,Photo,,,1530/2017-04-10/B/O/P/DG,,,,,,,,,,,,,,,,,,,,,,,,,,,,,,,,,,,,,,,,,,,,,,,,"building,Desiree Calvo Grunewald,Original,Photography",https://omeka.rmit.edu.vn/files/original/29bd16c4203e595c8507a56bc3ace05c.jpg,," BUILT ENVIRONMENT",1,0
6391,https://omeka.rmit.edu.vn/items/show/6391,"Worm view 13","worm view^^sky","A worm view of the Hem","Desiree Calvo Grunewald",,,4/10/2017,,"This work is licensed under a <a target=""_blank"" href=""https://creativecommons.org/licenses/by-nc-nd/4.0/"" rel=""noreferrer"">Creative Commons Attribution-NonCommercial-NoDerivatives 4.0 International License.</a>",,Photo,,,1587/2017-04-10/B/O/P/DG,,,,,,,,,,,,,,,,,,,,,,,,,,,,,,,,,,,,,,,,,,,,,,,,"building,Desiree Calvo Grunewald,Edited,Original,Photography",https://omeka.rmit.edu.vn/files/original/21c7da8f076002283434347c6b795a29.jpg,," BUILT ENVIRONMENT",1,0
6389,https://omeka.rmit.edu.vn/items/show/6389,"Worm view 12","worm view^^sky","A worm view of the Hem","Desiree Calvo Grunewald",,,4/10/2017,,"This work is licensed under a <a target=""_blank"" href=""https://creativecommons.org/licenses/by-nc-nd/4.0/"" rel=""noreferrer"">Creative Commons Attribution-NonCommercial-NoDerivatives 4.0 International License.</a>",,Photo,,,1585/2017-04-10/B/O/P/DG,,,,,,,,,,,,,,,,,,,,,,,,,,,,,,,,,,,,,,,,,,,,,,,,"building,Desiree Calvo Grunewald,Edited,nature,Original,Photography",https://omeka.rmit.edu.vn/files/original/ecf51319b0525c178b824730fe780795.jpg,," BUILT ENVIRONMENT",1,0
6386,https://omeka.rmit.edu.vn/items/show/6386,"Worm view 11","worm view^^sky","A worm view of the Hem","Desiree Calvo Grunewald",,,4/10/2017,,"This work is licensed under a <a target=""_blank"" href=""https://creativecommons.org/licenses/by-nc-nd/4.0/"" rel=""noreferrer"">Creative Commons Attribution-NonCommercial-NoDerivatives 4.0 International License.</a>",,Photo,,,1582/2017-04-10/B/O/P/DG,,,,,,,,,,,,,,,,,,,,,,,,,,,,,,,,,,,,,,,,,,,,,,,,"building,Desiree Calvo Grunewald,Edited,Original,Photography",https://omeka.rmit.edu.vn/files/original/0eede1a2fdbca77730e3ccff752825d6.jpg,," BUILT ENVIRONMENT",1,0
6369,https://omeka.rmit.edu.vn/items/show/6369,"Worm view 10","worm view^^sky","A worm view of the Hem","Desiree Calvo Grunewald",,,4/10/2017,,"This work is licensed under a <a target=""_blank"" href=""https://creativecommons.org/licenses/by-nc-nd/4.0/"" rel=""noreferrer"">Creative Commons Attribution-NonCommercial-NoDerivatives 4.0 International License.</a>",,Photo,,,1563/2017-04-10/B/O/P/DG,,,,,,,,,,,,,,,,,,,,,,,,,,,,,,,,,,,,,,,,,,,,,,,,"building,Desiree Calvo Grunewald,Original,Photography",https://omeka.rmit.edu.vn/files/original/68b6c0c34f8c32addd3bbe13c601158c.jpg,," BUILT ENVIRONMENT",1,0
6344,https://omeka.rmit.edu.vn/items/show/6344,"Worm view 1","worm view^^sky","A worm view of the Hem, revealing a small crack of blue sky","Desiree Calvo Grunewald",,,4/10/2017,,"This work is licensed under a <a target=""_blank"" href=""https://creativecommons.org/licenses/by-nc-nd/4.0/"" rel=""noreferrer"">Creative Commons Attribution-NonCommercial-NoDerivatives 4.0 International License.</a>",,Photo,,,1528/2017-04-10/B/O/P/DG,,,,,,,,,,,,,,,,,,,,,,,,,,,,,,,,,,,,,,,,,,,,,,,,"building,Desiree Calvo Grunewald,Original,Photography",https://omeka.rmit.edu.vn/files/original/05f5f1b05d55ae9be3db1c882836186a.jpg,," BUILT ENVIRONMENT",1,0
3947,https://omeka.rmit.edu.vn/items/show/3947,Wood,"wall^^wooden stick","Wood sticks being tied together by an orange fabric. The woods are leaning on a gray wall","Andrew Stiff",,"RMIT Vietnam Library",2016-11-13,,"This work is licensed under a <a target=""_blank"" href=""https://creativecommons.org/licenses/by-nc-nd/4.0/"" rel=""noreferrer"">Creative Commons Attribution-NonCommercial-NoDerivatives 4.0 International License.</a>",,image,,,0110/2016-11-13/H/O/P/AS,,,,,,,,,,,,,,,,,,,,,,,,,,,,,,,,,,,,,,,,,,,,,,,,"Andrew Stiff,building,human,Original,wood",https://omeka.rmit.edu.vn/files/original/20781a020c5c39e2a92773d1102dfb73.jpg,,COMMUNITY,1,0
5813,https://omeka.rmit.edu.vn/items/show/5813,Wired,wire^^wall,"Tangled wires and plastic string poking out a small hole on the wall","Desiree Calvo Grunewald",,,4/10/2017,,"This work is licensed under a <a target=""_blank"" href=""https://creativecommons.org/licenses/by-nc-nd/4.0/"" rel=""noreferrer"">Creative Commons Attribution-NonCommercial-NoDerivatives 4.0 International License.</a>",,Photo,,,1546/2017-04-10/H/O/P/DG,,,,,,,,,,,,,,,,,,,,,,,,,,,,,,,,,,,,,,,,,,,,,,,,"Abstract,building,Desiree Calvo Grunewald,human,Original,Photography,wires",https://omeka.rmit.edu.vn/files/original/8d62bd56640569bc8069db2a55e70cd2.jpg,,COMMUNITY,1,0
3938,https://omeka.rmit.edu.vn/items/show/3938,Wired,"electricity pole^^tree^^house","A photo of the electric wires tangled to each other","Andrew Stiff",,"RMIT Vietnam Library",2016-11-13,,"This work is licensed under a <a target=""_blank"" href=""https://creativecommons.org/licenses/by-nc-nd/4.0/"" rel=""noreferrer"">Creative Commons Attribution-NonCommercial-NoDerivatives 4.0 International License.</a>",,image,,,0101/2016-11-13/H/O/P/AS,,,,,,,,,,,,,,,,,,,,,,,,,,,,,,,,,,,,,,,,,,,,,,,,"Andrew Stiff,building,Original,wires",https://omeka.rmit.edu.vn/files/original/20c575b73ad5b7e49b84d9cdbe0e6066.jpg,,COMMUNITY,1,0
6340,https://omeka.rmit.edu.vn/items/show/6340,Wire,"wire^^electric pole","Electricity wires tangled","Desiree Calvo Grunewald",,,4/10/2017,,"This work is licensed under a <a target=""_blank"" href=""https://creativecommons.org/licenses/by-nc-nd/4.0/"" rel=""noreferrer"">Creative Commons Attribution-NonCommercial-NoDerivatives 4.0 International License.</a>",,Photo,,,1524/2017-04-10/B/O/P/DG,,,,,,,,,,,,,,,,,,,,,,,,,,,,,,,,,,,,,,,,,,,,,,,,"building,Desiree Calvo Grunewald,Original,Photography,wires",https://omeka.rmit.edu.vn/files/original/9a14388bcae4801b1c0d19ce783872c4.jpg,," BUILT ENVIRONMENT",1,0
6341,https://omeka.rmit.edu.vn/items/show/6341,Window,window^^yellow^^wall,"A yellow window on a contrasting green wall","Desiree Calvo Grunewald",,,4/10/2017,,"This work is licensed under a <a target=""_blank"" href=""https://creativecommons.org/licenses/by-nc-nd/4.0/"" rel=""noreferrer"">Creative Commons Attribution-NonCommercial-NoDerivatives 4.0 International License.</a>",,Photo,,,1525/2017-04-10/B/O/P/DG,,,,,,,,,,,,,,,,,,,,,,,,,,,,,,,,,,,,,,,,,,,,,,,,"building,Colour,Desiree Calvo Grunewald,Original,Photography",https://omeka.rmit.edu.vn/files/original/ef8de8308f65712e45d43a111c2a8ecf.jpg,," BUILT ENVIRONMENT",1,0
3953,https://omeka.rmit.edu.vn/items/show/3953,Water,"water drip^^wall^^moss","water drips on wall crack","Andrew Stiff",,"RMIT Vietnam Library",2017-03-03,,"This work is licensed under a <a target=""_blank"" href=""https://creativecommons.org/licenses/by-nc-nd/4.0/"" rel=""noreferrer"">Creative Commons Attribution-NonCommercial-NoDerivatives 4.0 International License.</a>",,video,,,0116/2017-03-03/N/E/V/AS,,,,,,,,,,,,,,,,,,,,,,,,,,,,,,,,,,,,,,,,,,,,,,,,"Andrew Stiff,building,Edited,nature,Video",https://omeka.rmit.edu.vn/files/original/d3ab75fe444331a55255e6c746e08757.mp4,," NATURE",1,0
3951,https://omeka.rmit.edu.vn/items/show/3951,Water,"water drip^^wall^^moss","water drips on wall crack","Andrew Stiff",,"RMIT Vietnam Library",2017-03-03,,"This work is licensed under a <a target=""_blank"" href=""https://creativecommons.org/licenses/by-nc-nd/4.0/"" rel=""noreferrer"">Creative Commons Attribution-NonCommercial-NoDerivatives 4.0 International License.</a>",,video,,,0114/2017-03-03/N/E/V/AS,,,,,,,,,,,,,,,,,,,,,,,,,,,,,,,,,,,,,,,,,,,,,,,,"Andrew Stiff,building,Edited,nature,Video",https://omeka.rmit.edu.vn/files/original/4639c87aaca7c289bd5456aff51bcf85.mp4,," NATURE",1,0
8387,https://omeka.rmit.edu.vn/items/show/8387,"Wall Detail 1",detail^^texture^^wall,"Close up detail of a heavily scuffed wall","Andrew Stiff",,,8/4/2017,,"This work is licensed under a <a target=""_blank"" href=""https://creativecommons.org/licenses/by-nc-nd/4.0/"" rel=""noreferrer"">Creative Commons Attribution-NonCommercial-NoDerivatives 4.0 International License.</a>",,Video,,,4290/2017-04-08/B/E/V/AS,,,,,,,,,,,,,,,,,,,,,,,,,,,,,,,,,,,,,,,,,,,,,,,,"Abstract,Andrew Stiff,building,Edited,Video",https://omeka.rmit.edu.vn/files/original/29e34c4746fc3fb8701317e503589271.mp4,," BUILT ENVIRONMENT",1,0
6327,https://omeka.rmit.edu.vn/items/show/6327,"Wall and orange pipe","wall^^iron sheet","A wall made of steel sheets and wire with an orange pipe in the front","Desiree Calvo Grunewald",,,4/10/2017,,"This work is licensed under a <a target=""_blank"" href=""https://creativecommons.org/licenses/by-nc-nd/4.0/"" rel=""noreferrer"">Creative Commons Attribution-NonCommercial-NoDerivatives 4.0 International License.</a>",,Photo,,,1502/2017-04-10/B/O/P/DG,,,,,,,,,,,,,,,,,,,,,,,,,,,,,,,,,,,,,,,,,,,,,,,,"Abstract,building,Desiree Calvo Grunewald,Original,Photography",https://omeka.rmit.edu.vn/files/original/24d841810f1342c6826325c73750fdc7.jpg,," BUILT ENVIRONMENT",1,0